It is currently 03 Mar 2021, 23:28
   
Text Size

The SVN, nightly builds and biweekly betas

Post MTG Forge Related Programming Questions Here

Moderators: timmermac, friarsol, Blacksmith, KrazyTheFox, Agetian, CCGHQ Admins

Re: The SVN, nightly builds and biweekly betas

Postby Chris H. » 17 Feb 2012, 11:50

We have a new snapshot build today. We apologize for the delay.

User avatar
Chris H.
Forge Moderator
 
Posts: 6320
Joined: 04 Nov 2008, 12:11
Location: Mac OS X Yosemite
Has thanked: 644 times
Been thanked: 643 times

Re: The SVN, nightly builds and biweekly betas

Postby squee1968 » 17 Feb 2012, 12:45

Got this when trying out the new snapshot:

Crash Report | Open
This is a Crash Report. An error has occurred. Please save this message to a file.
Please follow the instructions at this address to submit this Crash Report, plus what you were doing at the time:
http://tinyurl.com/3zzrnyb
Reporting bugs in Forge is very important. We thank you for your time.

null


Version:
Forge version 1.2.4-SNAPSHOT-r14126

OS: Windows XP Version: 5.1 Architecture: x86

Java Version: 1.6.0_26 Vendor: Sun Microsystems Inc.

Detailed error trace:
java.lang.ExceptionInInitializerError
at forge.CardReader.loadCardsUntilYouFind(CardReader.java:266)
at forge.CardReader.run(CardReader.java:250)
at forge.card.cardfactory.PreloadingCardFactory.readCards(PreloadingCardFactory.java:126)
at forge.card.cardfactory.PreloadingCardFactory.<init>(PreloadingCardFactory.java:83)
at forge.AllZone.getCardFactory(AllZone.java:329)
at forge.view.FView.initialize(FView.java:74)
at forge.view.Main.main(Main.java:59)
Caused by: java.lang.IllegalStateException: FProgressBar$reset must be accessed from the event dispatch thread.
at forge.gui.GuiUtils.checkEDT(GuiUtils.java:443)
at forge.view.toolbox.FProgressBar.reset(FProgressBar.java:69)
at forge.view.toolbox.FProgressBar.<init>(FProgressBar.java:29)
at forge.view.SplashFrame.<clinit>(SplashFrame.java:60)
... 7 more


And this when closing that report, if it helps:

Crash Report | Open
This is a Crash Report. An error has occurred. Please save this message to a file.
Please follow the instructions at this address to submit this Crash Report, plus what you were doing at the time:
http://tinyurl.com/3zzrnyb
Reporting bugs in Forge is very important. We thank you for your time.

Could not initialize class forge.view.SplashFrame


Version:
Forge version 1.2.4-SNAPSHOT-r14126

OS: Windows XP Version: 5.1 Architecture: x86

Java Version: 1.6.0_26 Vendor: Sun Microsystems Inc.

Detailed error trace:
java.lang.NoClassDefFoundError: Could not initialize class forge.view.SplashFrame
at forge.view.FView$1.run(FView.java:61)
at java.awt.event.InvocationEvent.dispatch(Unknown Source)
at java.awt.EventQueue.dispatchEventImpl(Unknown Source)
at java.awt.EventQueue.access$000(Unknown Source)
at java.awt.EventQueue$1.run(Unknown Source)
at java.awt.EventQueue$1.run(Unknown Source)
at java.security.AccessController.doPrivileged(Native Method)
at java.security.AccessControlContext$1.doIntersectionPrivilege(Unknown Source)
at java.awt.EventQueue.dispatchEvent(Unknown Source)
at java.awt.EventDispatchThread.pumpOneEventForFilters(Unknown Source)
at java.awt.EventDispatchThread.pumpEventsForFilter(Unknown Source)
at java.awt.EventDispatchThread.pumpEventsForHierarchy(Unknown Source)
at java.awt.EventDispatchThread.pumpEvents(Unknown Source)
at java.awt.EventDispatchThread.pumpEvents(Unknown Source)
at java.awt.EventDispatchThread.run(Unknown Source)
squee1968
 
Posts: 234
Joined: 18 Nov 2011, 03:28
Has thanked: 109 times
Been thanked: 43 times

Re: The SVN, nightly builds and biweekly betas

Postby Chris H. » 19 Feb 2012, 12:03

I updated my local copy to rev 14193 and discovered a problem uder Mac OS X Snow Leopard that does not appear under Mac OS X Lion.

I spend most of my time booted into Mac OS X Lion and forge will start up OK.

I boot into Mac OS X Snow Leopard to run the snapshot and beta builds and releases. I ran forge from Eclipse while booted under Mac OS X Snow Leopard and got the following crash report:

Crash Report | Open
This is a Crash Report. An error has occurred. Please save this message to a file.
Please follow the instructions at this address to submit this Crash Report, plus what you were doing at the time:
http://tinyurl.com/3zzrnyb
Reporting bugs in Forge is very important. We thank you for your time.

null


Version:
Forge version SVN

OS: Mac OS X Version: 10.6.8 Architecture: x86_64

Java Version: 1.6.0_26 Vendor: Apple Inc.

Detailed error trace:
java.lang.NullPointerException
at forge.view.Main$1.run(Main.java:95)
at java.awt.event.InvocationEvent.dispatch(InvocationEvent.java:209)
at java.awt.EventQueue.dispatchEventImpl(EventQueue.java:677)
at java.awt.EventQueue.access$000(EventQueue.java:85)
at java.awt.EventQueue$1.run(EventQueue.java:638)
at java.awt.EventQueue$1.run(EventQueue.java:636)
at java.security.AccessController.doPrivileged(Native Method)
at java.security.AccessControlContext$1.doIntersectionPrivilege(AccessControlContext.java:87)
at java.awt.EventQueue.dispatchEvent(EventQueue.java:647)
at java.awt.EventDispatchThread.pumpOneEventForFilters(EventDispatchThread.java:296)
at java.awt.EventDispatchThread.pumpEventsForFilter(EventDispatchThread.java:211)
at java.awt.EventDispatchThread.pumpEventsForFilter(EventDispatchThread.java:205)
at java.awt.Dialog$1.run(Dialog.java:1046)
at java.awt.Dialog$3.run(Dialog.java:1098)
at java.security.AccessController.doPrivileged(Native Method)
at java.awt.Dialog.show(Dialog.java:1096)
at java.awt.Component.show(Component.java:1584)
at java.awt.Component.setVisible(Component.java:1536)
at java.awt.Window.setVisible(Window.java:842)
at java.awt.Dialog.setVisible(Dialog.java:986)
at forge.error.ErrorViewer.showDialog(ErrorViewer.java:192)
at forge.error.ErrorViewer.showError(ErrorViewer.java:117)
at forge.error.ErrorViewer.showError(ErrorViewer.java:79)
at forge.error.ExceptionHandler.handle(ExceptionHandler.java:62)
at sun.reflect.NativeMethodAccessorImpl.invoke0(Native Method)
at sun.reflect.NativeMethodAccessorImpl.invoke(NativeMethodAccessorImpl.java:39)
at sun.reflect.DelegatingMethodAccessorImpl.invoke(DelegatingMethodAccessorImpl.java:25)
at java.lang.reflect.Method.invoke(Method.java:597)
at java.awt.EventDispatchThread.handleException(EventDispatchThread.java:412)
at java.awt.EventDispatchThread.processException(EventDispatchThread.java:318)
at java.awt.EventDispatchThread.pumpOneEventForFilters(EventDispatchThread.java:312)
at java.awt.EventDispatchThread.pumpEventsForFilter(EventDispatchThread.java:211)
at java.awt.EventDispatchThread.pumpEventsForHierarchy(EventDispatchThread.java:201)
at java.awt.EventDispatchThread.pumpEvents(EventDispatchThread.java:196)
at java.awt.EventDispatchThread.pumpEvents(EventDispatchThread.java:188)
at java.awt.EventDispatchThread.run(EventDispatchThread.java:122)
User avatar
Chris H.
Forge Moderator
 
Posts: 6320
Joined: 04 Nov 2008, 12:11
Location: Mac OS X Yosemite
Has thanked: 644 times
Been thanked: 643 times

Re: The SVN, nightly builds and biweekly betas

Postby Chris H. » 19 Feb 2012, 12:05

I think that Dave mentioned that he upgraded to Lion a couple of months ago.

Are you still using Snow Leopard Slapshot or have you also updated to Lion?
User avatar
Chris H.
Forge Moderator
 
Posts: 6320
Joined: 04 Nov 2008, 12:11
Location: Mac OS X Yosemite
Has thanked: 644 times
Been thanked: 643 times

Re: The SVN, nightly builds and biweekly betas

Postby slapshot5 » 19 Feb 2012, 12:08

Chris H. wrote:I think that Dave mentioned that he upgraded to Lion a couple of months ago.

Are you still using Snow Leopard Slapshot or have you also updated to Lion?
I'm still on Snow Leopard. I'll wait for Mountain Lion this summer before thinking about an upgrade.

-slapshot5
slapshot5
Programmer
 
Posts: 1391
Joined: 03 Jan 2010, 17:47
Location: Mac OS X
Has thanked: 25 times
Been thanked: 68 times

Re: The SVN, nightly builds and biweekly betas

Postby Chris H. » 19 Feb 2012, 12:21

slapshot5 wrote:I'm still on Snow Leopard. I'll wait for Mountain Lion this summer before thinking about an upgrade.
`
Are you able to run forge from within Eclipse while using rev 14193?

Just curious.

We have had a couple of bug reports come in the last couple of days that occur while starting up and I wonder if what I saw under Snow Leopard is being caused by a similar bug.
User avatar
Chris H.
Forge Moderator
 
Posts: 6320
Joined: 04 Nov 2008, 12:11
Location: Mac OS X Yosemite
Has thanked: 644 times
Been thanked: 643 times

Re: The SVN, nightly builds and biweekly betas

Postby Chris H. » 19 Feb 2012, 12:28

I booted back into Lion and ran forge from Eclipse and I now get the same crash report. In fact, there is a second crash report hidden underneath:

Crash Report | Open
This is a Crash Report. An error has occurred. Please save this message to a file.
Please follow the instructions at this address to submit this Crash Report, plus what you were doing at the time:
http://tinyurl.com/3zzrnyb
Reporting bugs in Forge is very important. We thank you for your time.

null


Version:
Forge version SVN

OS: Mac OS X Version: 10.7.3 Architecture: x86_64

Java Version: 1.6.0_29 Vendor: Apple Inc.

Detailed error trace:
java.lang.NullPointerException
at forge.deck.io.DeckSetSerializer.read(DeckSetSerializer.java:63)
at forge.deck.io.DeckSetSerializer.read(DeckSetSerializer.java:1)
at forge.deck.io.DeckSerializerBase.readAll(DeckSerializerBase.java:106)
at forge.util.FolderMapView.<init>(FolderMapView.java:47)
at forge.util.FolderMap.<init>(FolderMap.java:42)
at forge.deck.CardCollections.<init>(CardCollections.java:29)
at forge.AllZone.getDecks(AllZone.java:97)
at forge.control.home.ControlConstructed.getCustomNames(ControlConstructed.java:325)
at forge.control.home.ControlConstructed.updateDeckLists(ControlConstructed.java:162)
at forge.control.home.ControlConstructed.<init>(ControlConstructed.java:96)
at forge.view.home.ViewConstructed.<init>(ViewConstructed.java:67)
at forge.view.ViewHomeUI.<init>(ViewHomeUI.java:77)
at forge.view.FView.instantiateCachedUIStates(FView.java:164)
at forge.view.FView$2.run(FView.java:103)
at java.awt.event.InvocationEvent.dispatch(InvocationEvent.java:209)
at java.awt.EventQueue.dispatchEventImpl(EventQueue.java:677)
at java.awt.EventQueue.access$000(EventQueue.java:85)
at java.awt.EventQueue$1.run(EventQueue.java:638)
at java.awt.EventQueue$1.run(EventQueue.java:636)
at java.security.AccessController.doPrivileged(Native Method)
at java.security.AccessControlContext$1.doIntersectionPrivilege(AccessControlContext.java:87)
at java.awt.EventQueue.dispatchEvent(EventQueue.java:647)
at java.awt.EventDispatchThread.pumpOneEventForFilters(EventDispatchThread.java:296)
at java.awt.EventDispatchThread.pumpEventsForFilter(EventDispatchThread.java:211)
at java.awt.EventDispatchThread.pumpEventsForHierarchy(EventDispatchThread.java:201)
at java.awt.EventDispatchThread.pumpEvents(EventDispatchThread.java:196)
at java.awt.EventDispatchThread.pumpEvents(EventDispatchThread.java:188)
at java.awt.EventDispatchThread.run(EventDispatchThread.java:122)
User avatar
Chris H.
Forge Moderator
 
Posts: 6320
Joined: 04 Nov 2008, 12:11
Location: Mac OS X Yosemite
Has thanked: 644 times
Been thanked: 643 times

Re: The SVN, nightly builds and biweekly betas

Postby slapshot5 » 19 Feb 2012, 12:32

Chris H. wrote:Are you able to run forge from within Eclipse while using rev 14193?
No

error report | Open
This is a Crash Report. An error has occurred. Please save this message to a file.
Please follow the instructions at this address to submit this Crash Report, plus what you were doing at the time:
http://tinyurl.com/3zzrnyb
Reporting bugs in Forge is very important. We thank you for your time.

null


Version:
Forge version SVN

OS: Mac OS X Version: 10.6.8 Architecture: x86_64

Java Version: 1.6.0_29 Vendor: Apple Inc.

Detailed error trace:
java.lang.NullPointerException
at forge.view.Main$1.run(Main.java:99)
at java.awt.event.InvocationEvent.dispatch(InvocationEvent.java:209)
at java.awt.EventQueue.dispatchEventImpl(EventQueue.java:677)
at java.awt.EventQueue.access$000(EventQueue.java:85)
at java.awt.EventQueue$1.run(EventQueue.java:638)
at java.awt.EventQueue$1.run(EventQueue.java:636)
at java.security.AccessController.doPrivileged(Native Method)
at java.security.AccessControlContext$1.doIntersectionPrivilege(AccessControlContext.java:87)
at java.awt.EventQueue.dispatchEvent(EventQueue.java:647)
at java.awt.EventDispatchThread.pumpOneEventForFilters(EventDispatchThread.java:296)
at java.awt.EventDispatchThread.pumpEventsForFilter(EventDispatchThread.java:211)
at java.awt.EventDispatchThread.pumpEventsForFilter(EventDispatchThread.java:205)
at java.awt.Dialog$1.run(Dialog.java:1046)
at java.awt.Dialog$3.run(Dialog.java:1098)
at java.security.AccessController.doPrivileged(Native Method)
at java.awt.Dialog.show(Dialog.java:1096)
at java.awt.Component.show(Component.java:1584)
at java.awt.Component.setVisible(Component.java:1536)
at java.awt.Window.setVisible(Window.java:842)
at java.awt.Dialog.setVisible(Dialog.java:986)
at forge.error.ErrorViewer.showDialog(ErrorViewer.java:192)
at forge.error.ErrorViewer.showError(ErrorViewer.java:117)
at forge.error.ErrorViewer.showError(ErrorViewer.java:79)
at forge.error.ExceptionHandler.handle(ExceptionHandler.java:62)
at sun.reflect.NativeMethodAccessorImpl.invoke0(Native Method)
at sun.reflect.NativeMethodAccessorImpl.invoke(NativeMethodAccessorImpl.java:39)
at sun.reflect.DelegatingMethodAccessorImpl.invoke(DelegatingMethodAccessorImpl.java:25)
at java.lang.reflect.Method.invoke(Method.java:597)
at java.awt.EventDispatchThread.handleException(EventDispatchThread.java:412)
at java.awt.EventDispatchThread.processException(EventDispatchThread.java:318)
at java.awt.EventDispatchThread.pumpOneEventForFilters(EventDispatchThread.java:312)
at java.awt.EventDispatchThread.pumpEventsForFilter(EventDispatchThread.java:211)
at java.awt.EventDispatchThread.pumpEventsForHierarchy(EventDispatchThread.java:201)
at java.awt.EventDispatchThread.pumpEvents(EventDispatchThread.java:196)
at java.awt.EventDispatchThread.pumpEvents(EventDispatchThread.java:188)
at java.awt.EventDispatchThread.run(EventDispatchThread.java:122)


and

error report 2 | Open
This is a Crash Report. An error has occurred. Please save this message to a file.
Please follow the instructions at this address to submit this Crash Report, plus what you were doing at the time:
http://tinyurl.com/3zzrnyb
Reporting bugs in Forge is very important. We thank you for your time.

null


Version:
Forge version SVN

OS: Mac OS X Version: 10.6.8 Architecture: x86_64

Java Version: 1.6.0_29 Vendor: Apple Inc.

Detailed error trace:
java.lang.NullPointerException
at forge.deck.io.DeckSetSerializer.read(DeckSetSerializer.java:63)
at forge.deck.io.DeckSetSerializer.read(DeckSetSerializer.java:1)
at forge.deck.io.DeckSerializerBase.readAll(DeckSerializerBase.java:106)
at forge.util.FolderMapView.<init>(FolderMapView.java:47)
at forge.util.FolderMap.<init>(FolderMap.java:42)
at forge.deck.CardCollections.<init>(CardCollections.java:29)
at forge.AllZone.getDecks(AllZone.java:97)
at forge.control.home.ControlConstructed.getCustomNames(ControlConstructed.java:325)
at forge.control.home.ControlConstructed.updateDeckLists(ControlConstructed.java:162)
at forge.control.home.ControlConstructed.<init>(ControlConstructed.java:96)
at forge.view.home.ViewConstructed.<init>(ViewConstructed.java:67)
at forge.view.ViewHomeUI.<init>(ViewHomeUI.java:77)
at forge.view.FView.instantiateCachedUIStates(FView.java:164)
at forge.view.FView$2.run(FView.java:103)
at java.awt.event.InvocationEvent.dispatch(InvocationEvent.java:209)
at java.awt.EventQueue.dispatchEventImpl(EventQueue.java:677)
at java.awt.EventQueue.access$000(EventQueue.java:85)
at java.awt.EventQueue$1.run(EventQueue.java:638)
at java.awt.EventQueue$1.run(EventQueue.java:636)
at java.security.AccessController.doPrivileged(Native Method)
at java.security.AccessControlContext$1.doIntersectionPrivilege(AccessControlContext.java:87)
at java.awt.EventQueue.dispatchEvent(EventQueue.java:647)
at java.awt.EventDispatchThread.pumpOneEventForFilters(EventDispatchThread.java:296)
at java.awt.EventDispatchThread.pumpEventsForFilter(EventDispatchThread.java:211)
at java.awt.EventDispatchThread.pumpEventsForHierarchy(EventDispatchThread.java:201)
at java.awt.EventDispatchThread.pumpEvents(EventDispatchThread.java:196)
at java.awt.EventDispatchThread.pumpEvents(EventDispatchThread.java:188)
at java.awt.EventDispatchThread.run(EventDispatchThread.java:122)
slapshot5
Programmer
 
Posts: 1391
Joined: 03 Jan 2010, 17:47
Location: Mac OS X
Has thanked: 25 times
Been thanked: 68 times

Re: The SVN, nightly builds and biweekly betas

Postby Chris H. » 19 Feb 2012, 13:10

slapshot5 wrote:
Chris H. wrote:Are you able to run forge from within Eclipse while using rev 14193?
No

error report | Open
This is a Crash Report. An error has occurred. Please save this message to a file.
Please follow the instructions at this address to submit this Crash Report, plus what you were doing at the time:
http://tinyurl.com/3zzrnyb
Reporting bugs in Forge is very important. We thank you for your time.

null


Version:
Forge version SVN

OS: Mac OS X Version: 10.6.8 Architecture: x86_64

Java Version: 1.6.0_29 Vendor: Apple Inc.

Detailed error trace:
java.lang.NullPointerException
at forge.view.Main$1.run(Main.java:99)
at java.awt.event.InvocationEvent.dispatch(InvocationEvent.java:209)
at java.awt.EventQueue.dispatchEventImpl(EventQueue.java:677)
at java.awt.EventQueue.access$000(EventQueue.java:85)
at java.awt.EventQueue$1.run(EventQueue.java:638)
at java.awt.EventQueue$1.run(EventQueue.java:636)
at java.security.AccessController.doPrivileged(Native Method)
at java.security.AccessControlContext$1.doIntersectionPrivilege(AccessControlContext.java:87)
at java.awt.EventQueue.dispatchEvent(EventQueue.java:647)
at java.awt.EventDispatchThread.pumpOneEventForFilters(EventDispatchThread.java:296)
at java.awt.EventDispatchThread.pumpEventsForFilter(EventDispatchThread.java:211)
at java.awt.EventDispatchThread.pumpEventsForFilter(EventDispatchThread.java:205)
at java.awt.Dialog$1.run(Dialog.java:1046)
at java.awt.Dialog$3.run(Dialog.java:1098)
at java.security.AccessController.doPrivileged(Native Method)
at java.awt.Dialog.show(Dialog.java:1096)
at java.awt.Component.show(Component.java:1584)
at java.awt.Component.setVisible(Component.java:1536)
at java.awt.Window.setVisible(Window.java:842)
at java.awt.Dialog.setVisible(Dialog.java:986)
at forge.error.ErrorViewer.showDialog(ErrorViewer.java:192)
at forge.error.ErrorViewer.showError(ErrorViewer.java:117)
at forge.error.ErrorViewer.showError(ErrorViewer.java:79)
at forge.error.ExceptionHandler.handle(ExceptionHandler.java:62)
at sun.reflect.NativeMethodAccessorImpl.invoke0(Native Method)
at sun.reflect.NativeMethodAccessorImpl.invoke(NativeMethodAccessorImpl.java:39)
at sun.reflect.DelegatingMethodAccessorImpl.invoke(DelegatingMethodAccessorImpl.java:25)
at java.lang.reflect.Method.invoke(Method.java:597)
at java.awt.EventDispatchThread.handleException(EventDispatchThread.java:412)
at java.awt.EventDispatchThread.processException(EventDispatchThread.java:318)
at java.awt.EventDispatchThread.pumpOneEventForFilters(EventDispatchThread.java:312)
at java.awt.EventDispatchThread.pumpEventsForFilter(EventDispatchThread.java:211)
at java.awt.EventDispatchThread.pumpEventsForHierarchy(EventDispatchThread.java:201)
at java.awt.EventDispatchThread.pumpEvents(EventDispatchThread.java:196)
at java.awt.EventDispatchThread.pumpEvents(EventDispatchThread.java:188)
at java.awt.EventDispatchThread.run(EventDispatchThread.java:122)


and

error report 2 | Open
This is a Crash Report. An error has occurred. Please save this message to a file.
Please follow the instructions at this address to submit this Crash Report, plus what you were doing at the time:
http://tinyurl.com/3zzrnyb
Reporting bugs in Forge is very important. We thank you for your time.

null


Version:
Forge version SVN

OS: Mac OS X Version: 10.6.8 Architecture: x86_64

Java Version: 1.6.0_29 Vendor: Apple Inc.

Detailed error trace:
java.lang.NullPointerException
at forge.deck.io.DeckSetSerializer.read(DeckSetSerializer.java:63)
at forge.deck.io.DeckSetSerializer.read(DeckSetSerializer.java:1)
at forge.deck.io.DeckSerializerBase.readAll(DeckSerializerBase.java:106)
at forge.util.FolderMapView.<init>(FolderMapView.java:47)
at forge.util.FolderMap.<init>(FolderMap.java:42)
at forge.deck.CardCollections.<init>(CardCollections.java:29)
at forge.AllZone.getDecks(AllZone.java:97)
at forge.control.home.ControlConstructed.getCustomNames(ControlConstructed.java:325)
at forge.control.home.ControlConstructed.updateDeckLists(ControlConstructed.java:162)
at forge.control.home.ControlConstructed.<init>(ControlConstructed.java:96)
at forge.view.home.ViewConstructed.<init>(ViewConstructed.java:67)
at forge.view.ViewHomeUI.<init>(ViewHomeUI.java:77)
at forge.view.FView.instantiateCachedUIStates(FView.java:164)
at forge.view.FView$2.run(FView.java:103)
at java.awt.event.InvocationEvent.dispatch(InvocationEvent.java:209)
at java.awt.EventQueue.dispatchEventImpl(EventQueue.java:677)
at java.awt.EventQueue.access$000(EventQueue.java:85)
at java.awt.EventQueue$1.run(EventQueue.java:638)
at java.awt.EventQueue$1.run(EventQueue.java:636)
at java.security.AccessController.doPrivileged(Native Method)
at java.security.AccessControlContext$1.doIntersectionPrivilege(AccessControlContext.java:87)
at java.awt.EventQueue.dispatchEvent(EventQueue.java:647)
at java.awt.EventDispatchThread.pumpOneEventForFilters(EventDispatchThread.java:296)
at java.awt.EventDispatchThread.pumpEventsForFilter(EventDispatchThread.java:211)
at java.awt.EventDispatchThread.pumpEventsForHierarchy(EventDispatchThread.java:201)
at java.awt.EventDispatchThread.pumpEvents(EventDispatchThread.java:196)
at java.awt.EventDispatchThread.pumpEvents(EventDispatchThread.java:188)
at java.awt.EventDispatchThread.run(EventDispatchThread.java:122)
`
Think that I figured out the problem:

Re: About merging Draft and Sealed decks
User avatar
Chris H.
Forge Moderator
 
Posts: 6320
Joined: 04 Nov 2008, 12:11
Location: Mac OS X Yosemite
Has thanked: 644 times
Been thanked: 643 times

Re: The SVN, nightly builds and biweekly betas

Postby Iran » 20 Feb 2012, 02:13

I trying to run forge-1.2.4-20120219.133619-10 (r14196) but I get this crash Report

"Crash Report" | Open
This is a Crash Report. An error has occurred. Please save this message to a file.
Please follow the instructions at this address to submit this Crash Report, plus what you were doing at the time:
http://tinyurl.com/3zzrnyb
Reporting bugs in Forge is very important. We thank you for your time.

null


Version:
Forge version 1.2.4-SNAPSHOT-r14196

OS: Windows XP Version: 5.1 Architecture: x86

Java Version: 1.6.0_25 Vendor: Sun Microsystems Inc.

Detailed error trace:
java.lang.NullPointerException
at forge.view.Main$1.run(Main.java:99)
at java.awt.event.InvocationEvent.dispatch(Unknown Source)
at java.awt.EventQueue.dispatchEventImpl(Unknown Source)
at java.awt.EventQueue.access$000(Unknown Source)
at java.awt.EventQueue$1.run(Unknown Source)
at java.awt.EventQueue$1.run(Unknown Source)
at java.security.AccessController.doPrivileged(Native Method)
at java.security.AccessControlContext$1.doIntersectionPrivilege(Unknown Source)
at java.awt.EventQueue.dispatchEvent(Unknown Source)
at java.awt.EventDispatchThread.pumpOneEventForFilters(Unknown Source)
at java.awt.EventDispatchThread.pumpEventsForFilter(Unknown Source)
at java.awt.EventDispatchThread.pumpEventsForFilter(Unknown Source)
at java.awt.Dialog$1.run(Unknown Source)
at java.awt.Dialog$3.run(Unknown Source)
at java.security.AccessController.doPrivileged(Native Method)
at java.awt.Dialog.show(Unknown Source)
at java.awt.Component.show(Unknown Source)
at java.awt.Component.setVisible(Unknown Source)
at java.awt.Window.setVisible(Unknown Source)
at java.awt.Dialog.setVisible(Unknown Source)
at forge.error.ErrorViewer.showDialog(ErrorViewer.java:192)
at forge.error.ErrorViewer.showError(ErrorViewer.java:117)
at forge.error.ErrorViewer.showError(ErrorViewer.java:79)
at forge.error.ExceptionHandler.handle(ExceptionHandler.java:62)
at sun.reflect.NativeMethodAccessorImpl.invoke0(Native Method)
at sun.reflect.NativeMethodAccessorImpl.invoke(Unknown Source)
at sun.reflect.DelegatingMethodAccessorImpl.invoke(Unknown Source)
at java.lang.reflect.Method.invoke(Unknown Source)
at java.awt.EventDispatchThread.handleException(Unknown Source)
at java.awt.EventDispatchThread.processException(Unknown Source)
at java.awt.EventDispatchThread.pumpOneEventForFilters(Unknown Source)
at java.awt.EventDispatchThread.pumpEventsForFilter(Unknown Source)
at java.awt.EventDispatchThread.pumpEventsForHierarchy(Unknown Source)
at java.awt.EventDispatchThread.pumpEvents(Unknown Source)
at java.awt.EventDispatchThread.pumpEvents(Unknown Source)
at java.awt.EventDispatchThread.run(Unknown Source)


And when I close the Crash Report above , I receive the crash report below and the game can't continue.

"Crash Report" | Open
This is a Crash Report. An error has occurred. Please save this message to a file.
Please follow the instructions at this address to submit this Crash Report, plus what you were doing at the time:
http://tinyurl.com/3zzrnyb
Reporting bugs in Forge is very important. We thank you for your time.

null


Version:
Forge version 1.2.4-SNAPSHOT-r14196

OS: Windows XP Version: 5.1 Architecture: x86

Java Version: 1.6.0_25 Vendor: Sun Microsystems Inc.

Detailed error trace:
java.lang.NullPointerException
at forge.deck.io.OldDeckParser.convertConstructedAndSealed(OldDeckParser.java:129)
at forge.deck.io.OldDeckParser.tryParse(OldDeckParser.java:80)
at forge.deck.CardCollections.<init>(CardCollections.java:35)
at forge.AllZone.getDecks(AllZone.java:97)
at forge.control.home.ControlConstructed.getCustomNames(ControlConstructed.java:325)
at forge.control.home.ControlConstructed.updateDeckLists(ControlConstructed.java:162)
at forge.control.home.ControlConstructed.<init>(ControlConstructed.java:96)
at forge.view.home.ViewConstructed.<init>(ViewConstructed.java:67)
at forge.view.ViewHomeUI.<init>(ViewHomeUI.java:77)
at forge.view.FView.instantiateCachedUIStates(FView.java:164)
at forge.view.FView$2.run(FView.java:103)
at java.awt.event.InvocationEvent.dispatch(Unknown Source)
at java.awt.EventQueue.dispatchEventImpl(Unknown Source)
at java.awt.EventQueue.access$000(Unknown Source)
at java.awt.EventQueue$1.run(Unknown Source)
at java.awt.EventQueue$1.run(Unknown Source)
at java.security.AccessController.doPrivileged(Native Method)
at java.security.AccessControlContext$1.doIntersectionPrivilege(Unknown Source)
at java.awt.EventQueue.dispatchEvent(Unknown Source)
at java.awt.EventDispatchThread.pumpOneEventForFilters(Unknown Source)
at java.awt.EventDispatchThread.pumpEventsForFilter(Unknown Source)
at java.awt.EventDispatchThread.pumpEventsForHierarchy(Unknown Source)
at java.awt.EventDispatchThread.pumpEvents(Unknown Source)
at java.awt.EventDispatchThread.pumpEvents(Unknown Source)
at java.awt.EventDispatchThread.run(Unknown Source)
Iran
 
Posts: 251
Joined: 11 Jul 2011, 04:36
Has thanked: 61 times
Been thanked: 4 times

Re: The SVN, nightly builds and biweekly betas

Postby jeffwadsworth » 20 Feb 2012, 02:34

The next beta should work for you.
jeffwadsworth
Super Tester Elite
 
Posts: 1168
Joined: 20 Oct 2010, 04:47
Location: USA
Has thanked: 286 times
Been thanked: 68 times

Re: The SVN, nightly builds and biweekly betas

Postby Chris H. » 21 Feb 2012, 11:52

I updated my local copy to rev 14248 and the project will build and run from within Eclipse. When I run the Maven command to do a snapshot build and release from the terminal app I get an error during the tests and this creates a BUILD FAILURE and we do not get a release.

Code: Select all
Last login: Tue Feb 21 06:38:37 on ttys000
Macintosh:~ chrish$ /Users/chrish/Desktop/Daily\ Build\ to\ cardforge.command ; exit;
[INFO] Scanning for projects...
[INFO]                                                                         
[INFO] ------------------------------------------------------------------------
[INFO] Building Forge 1.2.4-SNAPSHOT
[INFO] ------------------------------------------------------------------------
Downloading: http://arcane.googlecode.com/svn/trunk/repository/com/google/code/jyield/jyield/1.0-SNAPSHOT/maven-metadata.xml
Downloading: http://arcane.googlecode.com/svn/trunk/repository/com/google/code/jyield/jyield/1.0-SNAPSHOT/maven-metadata.xml
[INFO]
[INFO] --- maven-clean-plugin:2.4.1:clean (default-clean) @ forge ---
[INFO] Deleting /Users/chrish/Workspace_SVN/ForgeSVN/target
[INFO]
[INFO] --- buildnumber-maven-plugin:1.0:create (default) @ forge ---
[INFO] Checking for local modifications: skipped.
[INFO] Updating project files from SCM: skipped.
[INFO] Executing: /bin/sh -c cd /Users/chrish/Workspace_SVN/ForgeSVN && svn --username releases@cardforge.org --password '*****' --no-auth-cache --non-interactive info
[INFO] Working directory: /Users/chrish/Workspace_SVN/ForgeSVN
[INFO] Storing buildNumber: 14223 at timestamp: 1329824646752
[INFO] Executing: /bin/sh -c cd /Users/chrish/Workspace_SVN/ForgeSVN && svn --username releases@cardforge.org --password '*****' --no-auth-cache --non-interactive info
[INFO] Working directory: /Users/chrish/Workspace_SVN/ForgeSVN
[INFO] Storing buildScmBranch: trunk
[INFO]
[INFO] --- build-helper-maven-plugin:1.7:released-version (released-version) @ forge ---
[INFO] artifact forge:forge: checking for updates from arcane-maven-repo
[INFO] artifact forge:forge: checking for updates from central
[INFO]
[INFO] --- build-helper-maven-plugin:1.7:parse-version (parse-version) @ forge ---
[INFO]
[INFO] --- maven-resources-plugin:2.5:resources (default-resources) @ forge ---
[debug] execute contextualize
[INFO] Using 'ISO-8859-1' encoding to copy filtered resources.
[INFO] Copying 1 resource
[INFO]
[INFO] --- maven-compiler-plugin:2.3.2:compile (default-compile) @ forge ---
[INFO] Compiling 541 source files to /Users/chrish/Workspace_SVN/ForgeSVN/target/classes
[INFO]
[INFO] --- maven-resources-plugin:2.5:testResources (default-testResources) @ forge ---
[debug] execute contextualize
[INFO] Using 'ISO-8859-1' encoding to copy filtered resources.
[INFO] skip non existing resourceDirectory /Users/chrish/Workspace_SVN/ForgeSVN/src/test/resources
[INFO]
[INFO] --- maven-compiler-plugin:2.3.2:testCompile (default-testCompile) @ forge ---
[INFO] Compiling 27 source files to /Users/chrish/Workspace_SVN/ForgeSVN/target/test-classes
[INFO]
[INFO] --- maven-surefire-plugin:2.12:test (default-test) @ forge ---
[INFO] Surefire report directory: /Users/chrish/Workspace_SVN/ForgeSVN/target/surefire-reports

-------------------------------------------------------
 T E S T S
-------------------------------------------------------
Running TestSuite
Configuring TestNG with: org.apache.maven.surefire.testng.conf.TestNGMapConfigurator@57bcc0bc
[white, red, blue]
Tests run: 14, Failures: 5, Errors: 0, Skipped: 0, Time elapsed: 1.22 sec <<< FAILURE!

Results :

Failed tests:   test_ctor_close_ctor(forge.model.FModelTest): model is not null expected object to not be null
  test_getBuildID(forge.model.FModelTest)
  test_getPreferences(forge.model.FModelTest)
  test_getVersion(forge.model.FModelTest)
  test_resetGameState_getGameState(forge.model.FModelTest)

Tests run: 14, Failures: 5, Errors: 0, Skipped: 0

[INFO] ------------------------------------------------------------------------
[INFO] BUILD FAILURE
[INFO] ------------------------------------------------------------------------
[INFO] Total time: 18.500s
[INFO] Finished at: Tue Feb 21 06:44:23 EST 2012
[INFO] Final Memory: 16M/105M
[INFO] ------------------------------------------------------------------------
[ERROR] Failed to execute goal org.apache.maven.plugins:maven-surefire-plugin:2.12:test (default-test) on project forge: There are test failures.
[ERROR]
[ERROR] Please refer to /Users/chrish/Workspace_SVN/ForgeSVN/target/surefire-reports for the individual test results.
[ERROR] -> [Help 1]
[ERROR]
[ERROR] To see the full stack trace of the errors, re-run Maven with the -e switch.
[ERROR] Re-run Maven using the -X switch to enable full debug logging.
[ERROR]
[ERROR] For more information about the errors and possible solutions, please read the following articles:
[ERROR] [Help 1] http://cwiki.apache.org/confluence/display/MAVEN/MojoFailureException
logout

[Process completed]

`
The surefire-reports for the individual test results:

surefire-reports for the individual test results | Open
test_ctor_close_ctor
"model is not null expected object to not be null"
org.testng.Assert.fail(Assert.java:89)
org.testng.Assert.assertNotNull(Assert.java:399)
forge.model.FModelTest.test_ctor_close_ctor(FModelTest.java:61)
sun.reflect.NativeMethodAccessorImpl.invoke0(Native Method)
sun.reflect.NativeMethodAccessorImpl.invoke(NativeMethodAccessorImpl.java:39)
sun.reflect.DelegatingMethodAccessorImpl.invoke(DelegatingMethodAccessorImpl.java:25)
java.lang.reflect.Method.invoke(Method.java:597)
org.testng.internal.MethodInvocationHelper.invokeMethod(MethodInvocationHelper.java:80)
org.testng.internal.Invoker.invokeMethod(Invoker.java:701)
org.testng.internal.Invoker.invokeTestMethod(Invoker.java:893)
org.testng.internal.Invoker.invokeTestMethods(Invoker.java:1218)
org.testng.internal.TestMethodWorker.invokeTestMethods(TestMethodWorker.java:127)
org.testng.internal.TestMethodWorker.run(TestMethodWorker.java:111)
org.testng.TestRunner.privateRun(TestRunner.java:758)
org.testng.TestRunner.run(TestRunner.java:613)
org.testng.SuiteRunner.runTest(SuiteRunner.java:334)
org.testng.SuiteRunner.runSequentially(SuiteRunner.java:329)
org.testng.SuiteRunner.privateRun(SuiteRunner.java:291)
org.testng.SuiteRunner.run(SuiteRunner.java:240)
org.testng.SuiteRunnerWorker.runSuite(SuiteRunnerWorker.java:53)
org.testng.SuiteRunnerWorker.run(SuiteRunnerWorker.java:87)
org.testng.TestNG.runSuitesSequentially(TestNG.java:1170)
org.testng.TestNG.runSuitesLocally(TestNG.java:1095)
org.testng.TestNG.run(TestNG.java:1007)
org.apache.maven.surefire.testng.TestNGExecutor.run(TestNGExecutor.java:76)
org.apache.maven.surefire.testng.TestNGDirectoryTestSuite.executeMulti(TestNGDirectoryTestSuite.java:161)
org.apache.maven.surefire.testng.TestNGDirectoryTestSuite.execute(TestNGDirectoryTestSuite.java:101)
org.apache.maven.surefire.testng.TestNGProvider.invoke(TestNGProvider.java:115)
sun.reflect.NativeMethodAccessorImpl.invoke0(Native Method)
sun.reflect.NativeMethodAccessorImpl.invoke(NativeMethodAccessorImpl.java:39)
sun.reflect.DelegatingMethodAccessorImpl.invoke(DelegatingMethodAccessorImpl.java:25)
java.lang.reflect.Method.invoke(Method.java:597)
org.apache.maven.surefire.util.ReflectionUtils.invokeMethodWithArray(ReflectionUtils.java:189)
org.apache.maven.surefire.booter.ProviderFactory$ProviderProxy.invoke(ProviderFactory.java:165)
org.apache.maven.surefire.booter.ProviderFactory.invokeProvider(ProviderFactory.java:85)
org.apache.maven.surefire.booter.ForkedBooter.runSuitesInProcess(ForkedBooter.java:103)
org.apache.maven.surefire.booter.ForkedBooter.main(ForkedBooter.java:74)

test_getBuildID
"null"
forge.model.FModelTest.test_getBuildID(FModelTest.java:98)
sun.reflect.NativeMethodAccessorImpl.invoke0(Native Method)
sun.reflect.NativeMethodAccessorImpl.invoke(NativeMethodAccessorImpl.java:39)
sun.reflect.DelegatingMethodAccessorImpl.invoke(DelegatingMethodAccessorImpl.java:25)
java.lang.reflect.Method.invoke(Method.java:597)
org.testng.internal.MethodInvocationHelper.invokeMethod(MethodInvocationHelper.java:80)
org.testng.internal.Invoker.invokeMethod(Invoker.java:701)
org.testng.internal.Invoker.invokeTestMethod(Invoker.java:893)
org.testng.internal.Invoker.invokeTestMethods(Invoker.java:1218)
org.testng.internal.TestMethodWorker.invokeTestMethods(TestMethodWorker.java:127)
org.testng.internal.TestMethodWorker.run(TestMethodWorker.java:111)
org.testng.TestRunner.privateRun(TestRunner.java:758)
org.testng.TestRunner.run(TestRunner.java:613)
org.testng.SuiteRunner.runTest(SuiteRunner.java:334)
org.testng.SuiteRunner.runSequentially(SuiteRunner.java:329)
org.testng.SuiteRunner.privateRun(SuiteRunner.java:291)
org.testng.SuiteRunner.run(SuiteRunner.java:240)
org.testng.SuiteRunnerWorker.runSuite(SuiteRunnerWorker.java:53)
org.testng.SuiteRunnerWorker.run(SuiteRunnerWorker.java:87)
org.testng.TestNG.runSuitesSequentially(TestNG.java:1170)
org.testng.TestNG.runSuitesLocally(TestNG.java:1095)
org.testng.TestNG.run(TestNG.java:1007)
org.apache.maven.surefire.testng.TestNGExecutor.run(TestNGExecutor.java:76)
org.apache.maven.surefire.testng.TestNGDirectoryTestSuite.executeMulti(TestNGDirectoryTestSuite.java:161)
org.apache.maven.surefire.testng.TestNGDirectoryTestSuite.execute(TestNGDirectoryTestSuite.java:101)
org.apache.maven.surefire.testng.TestNGProvider.invoke(TestNGProvider.java:115)
sun.reflect.NativeMethodAccessorImpl.invoke0(Native Method)
sun.reflect.NativeMethodAccessorImpl.invoke(NativeMethodAccessorImpl.java:39)
sun.reflect.DelegatingMethodAccessorImpl.invoke(DelegatingMethodAccessorImpl.java:25)
java.lang.reflect.Method.invoke(Method.java:597)
org.apache.maven.surefire.util.ReflectionUtils.invokeMethodWithArray(ReflectionUtils.java:189)
org.apache.maven.surefire.booter.ProviderFactory$ProviderProxy.invoke(ProviderFactory.java:165)
org.apache.maven.surefire.booter.ProviderFactory.invokeProvider(ProviderFactory.java:85)
org.apache.maven.surefire.booter.ForkedBooter.runSuitesInProcess(ForkedBooter.java:103)
org.apache.maven.surefire.booter.ForkedBooter.main(ForkedBooter.java:74)

test_getPreferences
"null"
forge.model.FModelTest.test_getPreferences(FModelTest.java:109)
sun.reflect.NativeMethodAccessorImpl.invoke0(Native Method)
sun.reflect.NativeMethodAccessorImpl.invoke(NativeMethodAccessorImpl.java:39)
sun.reflect.DelegatingMethodAccessorImpl.invoke(DelegatingMethodAccessorImpl.java:25)
java.lang.reflect.Method.invoke(Method.java:597)
org.testng.internal.MethodInvocationHelper.invokeMethod(MethodInvocationHelper.java:80)
org.testng.internal.Invoker.invokeMethod(Invoker.java:701)
org.testng.internal.Invoker.invokeTestMethod(Invoker.java:893)
org.testng.internal.Invoker.invokeTestMethods(Invoker.java:1218)
org.testng.internal.TestMethodWorker.invokeTestMethods(TestMethodWorker.java:127)
org.testng.internal.TestMethodWorker.run(TestMethodWorker.java:111)
org.testng.TestRunner.privateRun(TestRunner.java:758)
org.testng.TestRunner.run(TestRunner.java:613)
org.testng.SuiteRunner.runTest(SuiteRunner.java:334)
org.testng.SuiteRunner.runSequentially(SuiteRunner.java:329)
org.testng.SuiteRunner.privateRun(SuiteRunner.java:291)
org.testng.SuiteRunner.run(SuiteRunner.java:240)
org.testng.SuiteRunnerWorker.runSuite(SuiteRunnerWorker.java:53)
org.testng.SuiteRunnerWorker.run(SuiteRunnerWorker.java:87)
org.testng.TestNG.runSuitesSequentially(TestNG.java:1170)
org.testng.TestNG.runSuitesLocally(TestNG.java:1095)
org.testng.TestNG.run(TestNG.java:1007)
org.apache.maven.surefire.testng.TestNGExecutor.run(TestNGExecutor.java:76)
org.apache.maven.surefire.testng.TestNGDirectoryTestSuite.executeMulti(TestNGDirectoryTestSuite.java:161)
org.apache.maven.surefire.testng.TestNGDirectoryTestSuite.execute(TestNGDirectoryTestSuite.java:101)
org.apache.maven.surefire.testng.TestNGProvider.invoke(TestNGProvider.java:115)
sun.reflect.NativeMethodAccessorImpl.invoke0(Native Method)
sun.reflect.NativeMethodAccessorImpl.invoke(NativeMethodAccessorImpl.java:39)
sun.reflect.DelegatingMethodAccessorImpl.invoke(DelegatingMethodAccessorImpl.java:25)
java.lang.reflect.Method.invoke(Method.java:597)
org.apache.maven.surefire.util.ReflectionUtils.invokeMethodWithArray(ReflectionUtils.java:189)
org.apache.maven.surefire.booter.ProviderFactory$ProviderProxy.invoke(ProviderFactory.java:165)
org.apache.maven.surefire.booter.ProviderFactory.invokeProvider(ProviderFactory.java:85)
org.apache.maven.surefire.booter.ForkedBooter.runSuitesInProcess(ForkedBooter.java:103)
org.apache.maven.surefire.booter.ForkedBooter.main(ForkedBooter.java:74)

test_getVersion
"null"
forge.model.FModelTest.test_getVersion(FModelTest.java:78)
sun.reflect.NativeMethodAccessorImpl.invoke0(Native Method)
sun.reflect.NativeMethodAccessorImpl.invoke(NativeMethodAccessorImpl.java:39)
sun.reflect.DelegatingMethodAccessorImpl.invoke(DelegatingMethodAccessorImpl.java:25)
java.lang.reflect.Method.invoke(Method.java:597)
org.testng.internal.MethodInvocationHelper.invokeMethod(MethodInvocationHelper.java:80)
org.testng.internal.Invoker.invokeMethod(Invoker.java:701)
org.testng.internal.Invoker.invokeTestMethod(Invoker.java:893)
org.testng.internal.Invoker.invokeTestMethods(Invoker.java:1218)
org.testng.internal.TestMethodWorker.invokeTestMethods(TestMethodWorker.java:127)
org.testng.internal.TestMethodWorker.run(TestMethodWorker.java:111)
org.testng.TestRunner.privateRun(TestRunner.java:758)
org.testng.TestRunner.run(TestRunner.java:613)
org.testng.SuiteRunner.runTest(SuiteRunner.java:334)
org.testng.SuiteRunner.runSequentially(SuiteRunner.java:329)
org.testng.SuiteRunner.privateRun(SuiteRunner.java:291)
org.testng.SuiteRunner.run(SuiteRunner.java:240)
org.testng.SuiteRunnerWorker.runSuite(SuiteRunnerWorker.java:53)
org.testng.SuiteRunnerWorker.run(SuiteRunnerWorker.java:87)
org.testng.TestNG.runSuitesSequentially(TestNG.java:1170)
org.testng.TestNG.runSuitesLocally(TestNG.java:1095)
org.testng.TestNG.run(TestNG.java:1007)
org.apache.maven.surefire.testng.TestNGExecutor.run(TestNGExecutor.java:76)
org.apache.maven.surefire.testng.TestNGDirectoryTestSuite.executeMulti(TestNGDirectoryTestSuite.java:161)
org.apache.maven.surefire.testng.TestNGDirectoryTestSuite.execute(TestNGDirectoryTestSuite.java:101)
org.apache.maven.surefire.testng.TestNGProvider.invoke(TestNGProvider.java:115)
sun.reflect.NativeMethodAccessorImpl.invoke0(Native Method)
sun.reflect.NativeMethodAccessorImpl.invoke(NativeMethodAccessorImpl.java:39)
sun.reflect.DelegatingMethodAccessorImpl.invoke(DelegatingMethodAccessorImpl.java:25)
java.lang.reflect.Method.invoke(Method.java:597)
org.apache.maven.surefire.util.ReflectionUtils.invokeMethodWithArray(ReflectionUtils.java:189)
org.apache.maven.surefire.booter.ProviderFactory$ProviderProxy.invoke(ProviderFactory.java:165)
org.apache.maven.surefire.booter.ProviderFactory.invokeProvider(ProviderFactory.java:85)
org.apache.maven.surefire.booter.ForkedBooter.runSuitesInProcess(ForkedBooter.java:103)
org.apache.maven.surefire.booter.ForkedBooter.main(ForkedBooter.java:74)

test_resetGameState_getGameState
"null"
forge.model.FModelTest.test_resetGameState_getGameState(FModelTest.java:119)
sun.reflect.NativeMethodAccessorImpl.invoke0(Native Method)
sun.reflect.NativeMethodAccessorImpl.invoke(NativeMethodAccessorImpl.java:39)
sun.reflect.DelegatingMethodAccessorImpl.invoke(DelegatingMethodAccessorImpl.java:25)
java.lang.reflect.Method.invoke(Method.java:597)
org.testng.internal.MethodInvocationHelper.invokeMethod(MethodInvocationHelper.java:80)
org.testng.internal.Invoker.invokeMethod(Invoker.java:701)
org.testng.internal.Invoker.invokeTestMethod(Invoker.java:893)
org.testng.internal.Invoker.invokeTestMethods(Invoker.java:1218)
org.testng.internal.TestMethodWorker.invokeTestMethods(TestMethodWorker.java:127)
org.testng.internal.TestMethodWorker.run(TestMethodWorker.java:111)
org.testng.TestRunner.privateRun(TestRunner.java:758)
org.testng.TestRunner.run(TestRunner.java:613)
org.testng.SuiteRunner.runTest(SuiteRunner.java:334)
org.testng.SuiteRunner.runSequentially(SuiteRunner.java:329)
org.testng.SuiteRunner.privateRun(SuiteRunner.java:291)
org.testng.SuiteRunner.run(SuiteRunner.java:240)
org.testng.SuiteRunnerWorker.runSuite(SuiteRunnerWorker.java:53)
org.testng.SuiteRunnerWorker.run(SuiteRunnerWorker.java:87)
org.testng.TestNG.runSuitesSequentially(TestNG.java:1170)
org.testng.TestNG.runSuitesLocally(TestNG.java:1095)
org.testng.TestNG.run(TestNG.java:1007)
org.apache.maven.surefire.testng.TestNGExecutor.run(TestNGExecutor.java:76)
org.apache.maven.surefire.testng.TestNGDirectoryTestSuite.executeMulti(TestNGDirectoryTestSuite.java:161)
org.apache.maven.surefire.testng.TestNGDirectoryTestSuite.execute(TestNGDirectoryTestSuite.java:101)
org.apache.maven.surefire.testng.TestNGProvider.invoke(TestNGProvider.java:115)
sun.reflect.NativeMethodAccessorImpl.invoke0(Native Method)
sun.reflect.NativeMethodAccessorImpl.invoke(NativeMethodAccessorImpl.java:39)
sun.reflect.DelegatingMethodAccessorImpl.invoke(DelegatingMethodAccessorImpl.java:25)
java.lang.reflect.Method.invoke(Method.java:597)
org.apache.maven.surefire.util.ReflectionUtils.invokeMethodWithArray(ReflectionUtils.java:189)
org.apache.maven.surefire.booter.ProviderFactory$ProviderProxy.invoke(ProviderFactory.java:165)
org.apache.maven.surefire.booter.ProviderFactory.invokeProvider(ProviderFactory.java:85)
org.apache.maven.surefire.booter.ForkedBooter.runSuitesInProcess(ForkedBooter.java:103)
org.apache.maven.surefire.booter.ForkedBooter.main(ForkedBooter.java:74)
User avatar
Chris H.
Forge Moderator
 
Posts: 6320
Joined: 04 Nov 2008, 12:11
Location: Mac OS X Yosemite
Has thanked: 644 times
Been thanked: 643 times

Re: The SVN, nightly builds and biweekly betas

Postby Doublestrike » 21 Feb 2012, 12:41

Yeah, I've made some changes to FModel and GameState so the unit tests are invalid. I thought I commented out the critical parts for when they're ready for a rewrite? but I guess not.

I'm not sure how to proceed on this, I reckon we could delete now and retrieve/rewrite later if it's interesting....maybe.
---
A joke is a very serious thing.
User avatar
Doublestrike
UI Programmer
 
Posts: 715
Joined: 08 Aug 2011, 09:07
Location: Bali
Has thanked: 183 times
Been thanked: 161 times

Re: The SVN, nightly builds and biweekly betas

Postby Chris H. » 21 Feb 2012, 12:56

Doublestrike wrote:Yeah, I've made some changes to FModel and GameState so the unit tests are invalid. I thought I commented out the critical parts for when they're ready for a rewrite? but I guess not.

I'm not sure how to proceed on this, I reckon we could delete now and retrieve/rewrite later if it's interesting....maybe.
`
Yeah, I too am not sure how to proceed.

Do the surefire-reports for the individual test results provide any hints?
User avatar
Chris H.
Forge Moderator
 
Posts: 6320
Joined: 04 Nov 2008, 12:11
Location: Mac OS X Yosemite
Has thanked: 644 times
Been thanked: 643 times

Re: The SVN, nightly builds and biweekly betas

Postby jendave » 21 Feb 2012, 16:48

As a quick and dirty solution, I disabled the tests. The build works now, but the tests should be fixed.
jendave
 
Posts: 307
Joined: 01 Jun 2008, 07:19
Has thanked: 8 times
Been thanked: 21 times

PreviousNext

Return to Developer's Corner

Who is online

Users browsing this forum: No registered users and 27 guests


Who is online

In total there are 27 users online :: 0 registered, 0 hidden and 27 guests (based on users active over the past 10 minutes)
Most users ever online was 1371 on 09 Feb 2020, 16:22

Users browsing this forum: No registered users and 27 guests

Login Form